commodity fetishism
definition: Commodity fetishism refers to the exaggerated value of, and desire for, commodities which occurs within complex capitalist societies. The term is derived from the work of Marx and, in particular, the opening chapter to his seminal work Capital (originally published in 1867). [Source: The SAGE Dictionary of Leisure Studies; Commodity Fetishism]
broader: critical management studies
type: Concept

critical management studies
type: Concept
narrower: commodity fetishism

concepts
type: Collection
type: ConceptGroup
member: commodity fetishism