community-based housing
type: Concept
narrower: common interest development

common interest development
definition: Common interest developments (CIDs) go by several names, including residential community associations and common interest communities. They can include many types of housing ranging from detached single-family homes or townhouses in a planned unit development to apartment units in a condominium or cooperative. [Source: Encyclopedia of Urban Studies; Common Interest Development]
broader: community-based housing
type: Concept

concepts
type: Collection
type: ConceptGroup
member: common interest development