comparable worth
definition: Comparable worth is the theory that states that wages for particular occupations, most notably those traditionally filled by women, should be set by an assessment of the meaningfulness of the work in relation to jobs of similar worth rather than through a market-determined process that often results in lower wages for women in certain jobs. Factors such as education, skills, effort, responsibility, experience, and other relevant factors are all part of a formula to determine the relative worth of a job and the employee is paid consistent with that determination. [Source: Encyclopedia of Business Ethics and Society; Comparable Worth]
broader: equal pay
type: Concept

equal pay
type: Concept
narrower: comparable worth

concepts
type: Collection
type: ConceptGroup
member: comparable worth