career development initiatives
type: Concept
narrower: computer-based career support systems

computer-based career support systems
definition: Computer-based career support (CBCS) systems are information and communication technology (ICT) applications aimed at assisting individuals in their careers through the provision of online career support services. CBCS systems include a mix of career support services that correspond to four general functions of “social support”: informational, appraisal, instrumental, and emotional support. [Source: Encyclopedia of Career Development; Computer-Based Career Support Systems]
broader: career development initiatives
type: Concept

concepts
type: Collection
type: ConceptGroup
member: computer-based career support systems