computer use and cognitive skills
definition: Does computer use affect cognitive skills? The reasoning behind this question is that use of a tool such as the computer requires specific cognitive skills, so repeated use of the tool may have an effect on those skills. Research addressing this question has mostly focused on the informal uses of the computer within the home, such as computer and video games. [Source: Encyclopedia of Children, Adolescents, and the Media; Cognitive Skills, Computer Use and]
broader: computers and electronic media
type: Concept

computers and electronic media
type: Concept
narrower: computer use and cognitive skills

concepts
type: Collection
type: ConceptGroup
member: computer use and cognitive skills