conceptions of progressive education
definition: The term progressive education proves to be as amorphous as the term curriculum itself. Little consensus exists, and the concept, although often not specifically defined, leads to much misunderstanding. [Source: Encyclopedia of Curriculum Studies; Progressive Education, Conceptions Of]
broader: theoretical perspectives
type: Concept

concepts
type: Collection
type: ConceptGroup
member: conceptions of progressive education

theoretical perspectives
type: Concept
narrower: conceptions of progressive education