constitutional monarchy
definition: Constitutional monarchy is a type of government in which a sovereign can rule under the limits of a constitution. The text of the constitution or its principles limit the sovereign power, and subsequently, government ministers formulate parliamentary acts and assume responsibility for the government. [Source: The Encyclopedia of Political Science; Constitutional Monarchy]
broader: constitutions and constitutionalism
type: Concept

constitutions and constitutionalism
type: Concept
narrower: constitutional monarchy

concepts
type: Collection
type: ConceptGroup
member: constitutional monarchy