concepts
type: Collection
type: ConceptGroup
member: coping capacity and response capability

coping capacity and response capability
definition: Crisis events present challenges to people that fall well outside the realm of normal human experience, possibly for periods of time that can range from months to years, decades, or a lifetime. This circumstance can thus require the development of new coping and response mechanisms to supplement or complement those used in more routine contexts. [Source: Encyclopedia of Crisis Management; Coping Capacity and Response Capability]
broader: issues in crisis management
type: Concept

issues in crisis management
type: Concept
narrower: coping capacity and response capability