social science of networking
type: Concept
narrower: corporate networking

concepts
type: Collection
type: ConceptGroup
member: corporate networking

corporate networking
definition: The various relations and networks of modern life are complex. Both private and business spheres are determined by different networks, such as energy, transportation, economics, and socializing. [Source: Encyclopedia of Social Networks; Corporate Networking]
broader: social science of networking
type: Concept