continuing education
type: Concept
narrower: corporate training

concepts
type: Collection
type: ConceptGroup
member: corporate training

corporate training
definition: Corporate training in distributed learning refers to the development, design, and delivery of training and education programs for employees who are dispersed geographically. Corporate training programs can be delivered in both in-person and online learning formats. [Source: Encyclopedia of Distributed Learning; Corporate Training]
broader: continuing education
type: Concept