perpetrators
type: Concept
narrower: crack house

crack house
definition: a house or other dwelling, often vacant, used by crack addicts to get high. Crack houses are often the target of law enforcement efforts to clean up socially disorganized neighborhoods. [Source: The Concise Dictionary of Crime and Justice; Crack House]
broader: perpetrators
type: Concept

concepts
type: Collection
type: ConceptGroup
member: crack house