creative organizational climate
definition: If creativity is the making and communicating of meaningful new connections, then what kind of environment promotes this kind of activity? This is a key issue for those who teach, train, lead, and manage; particularly due to the increasing demand for creativity and innovation.Environment, or climate, is a measurable concept. It could be considered the state within which an individual finds him- or herself; the team or group situation; the conditions within a family, school, or community; the atmosphere within an organization; a national or cultural milieu; or even the global environment. [Source: Encyclopedia of Giftedness, Creativity, and Talent; Creative Organizational Climate]
broader: creativity studies
type: Concept

creativity studies
type: Concept
narrower: creative organizational climate

concepts
type: Collection
type: ConceptGroup
member: creative organizational climate