cribbage
definition: No one knows exactly when Cribbage was invented. The rules were formalized in the 17th century by English poet Sir John Suckling. [Source: Encyclopedia of Play in Today's Society; Cribbage]
broader: card games
type: Concept

concepts
type: Collection
type: ConceptGroup
member: cribbage

card games
type: Concept
narrower: cribbage