cross-sectional studies
definition: Cross-sectional health studies present a snapshot of a disease, exposure, or health outcome at a specific point in time for a specific population. This snapshot often provides useful information for health services researchers and other healthcare professionals. [Source: Encyclopedia of Health Services Research; Cross-Sectional Studies]
broader: epidemiologic studies
type: Concept

epidemiologic studies
type: Concept
narrower: cross-sectional studies

concepts
type: Collection
type: ConceptGroup
member: cross-sectional studies