cultural context
definition: Cultural context consists of the broad background of beliefs and practices that guide the behaviors of both the researcher and research participants. Cultural context is an essential element of any research project because it affects not only the individual behavior of the researcher and participants but also their interactions with each other. [Source: The SAGE Encyclopedia of Qualitative Research Methods; Cultural Context]
broader: textual analysis
type: Concept

concepts
type: Collection
type: ConceptGroup
member: cultural context

textual analysis
type: Concept
narrower: cultural context