perspective of the decision maker
type: Concept
narrower: cultural issues

cultural issues
definition: Culture encompasses the acquired knowledge, beliefs, values, and behavior patterns shared by the members of a particular group of people. Common elements of cultures include language, diet, dress, and religion, among others. [Source: Encyclopedia of Medical Decision Making; Cultural Issues]
broader: perspective of the decision maker
type: Concept

concepts
type: Collection
type: ConceptGroup
member: cultural issues