curriculum discourses
definition: The contemporary field of curriculum studies draws together scholars who are interested in a wide range of ideas. Throughout the 20th (and now 21st) century, several schools of thought have emerged from the many conversations among curriculum studies scholars. [Source: Encyclopedia of Curriculum Studies; Curriculum Discourses]
broader: curriculum theory
type: Concept

concepts
type: Collection
type: ConceptGroup
member: curriculum discourses

curriculum theory
type: Concept
narrower: curriculum discourses