human-induced disasters
type: Concept
narrower: cyberattacks

cyberattacks
definition: While traditional defenses against crime and terrorism have focused on staving off attacks on humans and brick-and-mortar targets, in recent decades, attacks upon computer systems have become common. Threats to computer systems can destroy data, inconvenience users, and disrupt financial and governmental organizations. [Source: Encyclopedia of Disaster Relief; Cyberattacks]
broader: human-induced disasters
type: Concept

concepts
type: Collection
type: ConceptGroup
member: cyberattacks