concepts
type: Collection
type: ConceptGroup
member: damage containment

damage containment
definition: Damage containment—often referred to as “damage control” or just “containment”—is identified by most emergency management researchers as the most often overlooked aspect of emergency planning. Planning for damage containment is as an element of mitigation and actually occurs in two stages. [Source: Encyclopedia of Crisis Management; Damage Containment]
broader: issues in crisis management
type: Concept

issues in crisis management
type: Concept
narrower: damage containment