damascus road
definition: DAMASCUS ROAD was founded in 1995 in Chicago, Illinois, during the Restoring Our Sight Conference. The name Damascus Road refers to the process of transformation that Saul experienced on the road to Damascus (Acts 9:1–31). [Source: Encyclopedia of World Poverty; Damascus Road]
broader: religious and secular charities
type: Concept

concepts
type: Collection
type: ConceptGroup
member: damascus road

religious and secular charities
type: Concept
narrower: damascus road