cartography
type: Concept
narrower: data classification schemes

data classification schemes
definition: In the graphic display of quantitative information, various classification schemes are used to organize data for meaningful interpretation. The human mind makes sense of the world by grouping and ordering what the senses perceive. [Source: Encyclopedia of Geography; Data Classification Schemes]
broader: cartography
type: Concept

concepts
type: Collection
type: ConceptGroup
member: data classification schemes