corporate crisis management
type: Concept
narrower: data mirroring

data mirroring
definition: As individuals, organizations, government entities, and corporations prepare to deal with potential disasters and crises that may arise, data mirroring has come to represent increasingly important practices, policies, and procedures for these groups. Data mirroring involves the replication of data stored on logical disk volumes on separate physical hard disks, often in real time, so that continuous availability of that data is ensured. [Source: Encyclopedia of Crisis Management; Data Mirroring]
broader: corporate crisis management
type: Concept

concepts
type: Collection
type: ConceptGroup
member: data mirroring