sources of data and research on transnational crime
type: Concept
narrower: data sources: empirical data

concepts
type: Collection
type: ConceptGroup
member: data sources: empirical data

data sources: empirical data
definition: In general, criminology is a scientific approach to the study of criminal behavior. One of the first scientific approaches in criminology was the work of Cesare Beccaria in 1764 related to torture and the death penalty. [Source: Encyclopedia of Transnational Crime & Justice; Data Sources: Empirical Data]
broader: sources of data and research on transnational crime
type: Concept