data warehouse
definition: A data warehouse is a centralized, large-sized repository of databases and data files that allows users to access data, to perform data query functions, or to conduct data analyses. Most data warehouses utilize advanced network technologies and frameworks (such as the Internet and the World Wide Web) to provide flexible access of databases and files. [Source: Encyclopedia of Geographic Information Science; Data Warehouse]
broader: organizational and institutional aspects
type: Concept

methods
type: Collection
type: ConceptGroup
member: data warehouse

organizational and institutional aspects
type: Concept
narrower: data warehouse