deathbed scene
definition: Deathbed scenes are representations of the end of some person's life. The person may be real or fictional, and the presence of an actual bed is symbolic rather than necessary. [Source: Encyclopedia of Death and the Human Experience; Deathbed Scene]
broader: process of dying
type: Concept

process of dying
type: Concept
narrower: deathbed scene

concepts
type: Collection
type: ConceptGroup
member: deathbed scene