dehumanization of blacks
definition: To dehumanize means to deprive a person of human qualities, attributes, and rights. It is the psychological process of demonizing a person, making that person seem less than human and hence not worthy of humane treatment. [Source: Encyclopedia of Race and Crime; Dehumanization of Blacks]
broader: specific populations
type: Concept

specific populations
type: Concept
narrower: dehumanization of blacks

concepts
type: Collection
type: ConceptGroup
member: dehumanization of blacks