democratic deficit
definition: The notion of a democratic deficit refers to an insufficient level of democracy in political institutions and procedures in comparison with a theoretical ideal of a democratic government. The expression democratic deficit may be used to denote the absence or underdevelopment of key democratic institutions, but it may also be used to reflect the pathologies of how these institutions function (e.g., lack of transparency and accountability, technocratic decision making, inadequate participation of citizens in policy making). [Source: Encyclopedia of Governance; Democratic Deficit]
broader: democratic theory
type: Concept

democratic theory
type: Concept
narrower: democratic deficit

concepts
type: Collection
type: ConceptGroup
member: democratic deficit