denotation
definition: The dominant meaning, or representation, of a word or a thing. The generally accepted view of denotation is in relationship to the secondary meaning (connotation), although some scholars dispute their distinct separation. [Source: The SAGE Glossary of the Social and Behavioral Sciences; Denotation]
broader: textual analysis
type: Concept

concepts
type: Collection
type: ConceptGroup
member: denotation

textual analysis
type: Concept
narrower: denotation