emotion processes in relationships
type: Concept
narrower: depression and relationships

concepts
type: Collection
type: ConceptGroup
member: depression and relationships

depression and relationships
definition: Depression is a pervasive psychosocial problem that is a constellation of cognitive (e.g., difficulty concentrating), vegetative (e.g., loss of appetite), and affective (e.g., sad mood) symptoms. About 10 to 15 percent of the population will experience an episode of clinical depression at some point in their lives, and far more will suffer from subclinical levels of depression. [Source: Encyclopedia of Human Relationships; Depression and Relationships]
broader: emotion processes in relationships
type: Concept