depressive realism
definition: Definition Depressive realism refers to the findings that depressed individuals tend to be more accurate or realistic than nondepressed persons in their judgments about themselves. Specifically, research suggests that nondepressed people are vulnerable to cognitive illusions, including unrealistic optimism, overestimation of themselves, and an exaggerated sense of their capacity to control events. [Source: Encyclopedia of Social Psychology; Depressive Realism]
broader: social cognition
type: Concept

social cognition
type: Concept
narrower: depressive realism

concepts
type: Collection
type: ConceptGroup
member: depressive realism