developmental victimology
definition: Developmental victimology focuses on the victimization of children. Its attention is expansive and includes abuse and neglect and physical and sexual abuse as well as other kinds of victimization, such as peer and sibling assaults. [Source: Encyclopedia of Victimology and Crime Prevention; Developmental Victimology]
broader: victimology
type: Concept

victimology
type: Concept
narrower: developmental victimology

concepts
type: Collection
type: ConceptGroup
member: developmental victimology