concepts
type: Collection
type: ConceptGroup
member: devil

religion
type: Concept
narrower: devil

devil
definition: The devil by definition is a powerful force of evil, either a real spiritual personality or a metaphor for human evil. As such, the concept of the devil exists only in monotheist religions including Judaism, Christianity, Zoroastrianism, and Islam. [Source: Encyclopedia of Death and the Human Experience; Devil]
broader: religion
type: Concept