diabetic teeth and gum problems
definition: Both type 1 and type 2 diabetes mellitus (DM) are associated with a higher prevalence of periodontitis, an infection of the gums and the tooth-supporting bones and ligaments of the mouth. Its symptoms include redness, swelling, and pain around the teeth, in addition to loose teeth. [Source: Encyclopedia of Global Health; Diabetic Teeth and Gum Problems]
broader: localized diseases
type: Concept

concepts
type: Collection
type: ConceptGroup
member: diabetic teeth and gum problems

localized diseases
type: Concept
narrower: diabetic teeth and gum problems