disruption of organizations
definition: Social organizations cannot function as expected if they are disrupted by crises or disasters. Personnel loss and facilities damage are two common features of organizational disruption. [Source: Encyclopedia of Crisis Management; Disruption of Organizations]
broader: issues in crisis management
type: Concept

concepts
type: Collection
type: ConceptGroup
member: disruption of organizations

issues in crisis management
type: Concept
narrower: disruption of organizations