drive theory
definition: Definition Drive refers to increased arousal and internal motivation to reach a particular goal. Psychologists differentiate between primary and secondary drives. [Source: Encyclopedia of Social Psychology; Drive Theory]
broader: action control
type: Concept

action control
type: Concept
narrower: drive theory

concepts
type: Collection
type: ConceptGroup
member: drive theory