public administration
type: Concept
narrower: dual executive

concepts
type: Collection
type: ConceptGroup
member: dual executive

dual executive
definition: Among democratic political systems across the world, three models of organizing relations between the executive and legislative branches of government exist: parliamentary, presidential, and dual executive systems. In a parliamentary system, the executive consists of a cabinet that is headed by the prime minister and arises directly from the legislature. [Source: The Encyclopedia of Political Science; Dual Executive]
broader: public administration
type: Concept