geographic information systems
type: Concept
narrower: dynamic and interactive displays

dynamic and interactive displays
definition: The term dynamic display is applied to displays capable of change, in contrast to static displays, such as paper maps and graphics. Changes in a dynamic display may occur in an automatic manner or in response to actions of the user. [Source: Encyclopedia of Geography; Dynamic and Interactive Displays]
broader: geographic information systems
type: Concept

concepts
type: Collection
type: ConceptGroup
member: dynamic and interactive displays