ecogenetics
definition: Related to environmental sciences (particularly environmental health or biomedicine) and to molecular biology and genetics, ecogenetics is an emergent discipline in the interphase of these sciences. Ecogenetics initially attempted to study and understand how the genetic and environmental factors could together influence the organism's response to carcinogenic agents and other imposed stresses. [Source: Encyclopedia of Global Health; Ecogenetics]
broader: health sciences
type: Concept

concepts
type: Collection
type: ConceptGroup
member: ecogenetics

health sciences
type: Concept
narrower: ecogenetics