effects of optimism on relationships
definition: One enduring lesson from social and personality psychology is that beliefs affect social behavior. Beliefs can proactively shape the ways that individuals perceive and make sense of social situations, and beliefs can affect how individuals behave toward others. [Source: Encyclopedia of Human Relationships; Optimism, Effects on Relationships]
broader: personality and individual differences
type: Concept

personality and individual differences
type: Concept
narrower: effects of optimism on relationships

concepts
type: Collection
type: ConceptGroup
member: effects of optimism on relationships