election monitoring
definition: Election monitoring is the process by which external or noninterested actors evaluate the legitimacy of balloting. Credible elections are central to democracy, and election observers aid in the acceptance of polling as relatively free of manipulation or free and fair. [Source: The Encyclopedia of Political Science; Election Monitoring]
broader: representation and electoral systems
type: Concept

representation and electoral systems
type: Concept
narrower: election monitoring

concepts
type: Collection
type: ConceptGroup
member: election monitoring