election research
definition: As the defining institution of democracy, elections have always been a major focus of attention both for political theorists and analysts—and for journalists and practicing politicians. Indeed, it is hard to talk about democracy, either generally or at a national level, without referring to elections. [Source: International Encyclopedia of Political Science; Election Research]
broader: decision making in democracies
type: Concept

decision making in democracies
type: Concept
narrower: election research

concepts
type: Collection
type: ConceptGroup
member: election research