emergency operations center
definition: The emergency operations center (EOC) is a predesignated facility established by an agency or jurisdiction to coordinate the overall agency or jurisdictional response and support to an emergency. Although the physical facilities and operating structure may vary, all emergency operations centers share the common functions of situation assessment, strategy development, and resource allocation. [Source: Encyclopedia of Crisis Management; Emergency Operations Center]
broader: issues in crisis management
type: Concept

concepts
type: Collection
type: ConceptGroup
member: emergency operations center

issues in crisis management
type: Concept
narrower: emergency operations center