employee communication
definition: Employee communication is the context in which messages are communicated internally to an organization for direct and indirect strategic organizational purposes. It serves within an organizational context as well by the channel, level, and networks used to most effectively and efficiently communicate to or with employees. [Source: Encyclopedia of Public Relations; Employee Communication]
broader: employee relations
type: Concept

concepts
type: Collection
type: ConceptGroup
member: employee communication

employee relations
type: Concept
narrower: employee communication