social cognition
type: Concept
narrower: encoding

encoding
definition: Encoding information is the cognitive process through which experiences are translated into memory. However, for the social sciences, encoding often means the process of translating thoughts, ideas, or questions into words. [Source: Encyclopedia of Survey Research Methods; Encoding]
broader: social cognition
type: Concept

concepts
type: Collection
type: ConceptGroup
member: encoding