exercise physiology
type: Concept
narrower: endurance training

concepts
type: Collection
type: ConceptGroup
member: endurance training

endurance training
definition: Endurance is the ability of an individual to perform repeated skeletal muscle contractions at a prescribed submaximal power output or speed. The capacity of an organ system to adapt to repeated bouts of physical activity so that its exercise capacity is improved is termed physical training. [Source: Encyclopedia of Lifestyle Medicine & Health; Endurance Training]
broader: exercise physiology
type: Concept