geographic information systems
type: Concept
narrower: environmental model integration and GIS

environmental model integration and GIS
definition: Environmental process models describe the exchange of energy and materials through space and time and assess their impact on the environment. Many environmental process models are closed monolithic systems that cannot be easily modified. [Source: Encyclopedia of Geography; GIS, Environmental Model Integration and]
broader: geographic information systems
type: Concept

concepts
type: Collection
type: ConceptGroup
member: environmental model integration and GIS