behavioral therapy
type: Concept
narrower: errorless compliance training

concepts
type: Collection
type: ConceptGroup
member: errorless compliance training

errorless compliance training
definition: Errorless compliance training provides an alternative to traditional parent management training approaches for reducing antisocial responses in children. Following an assessment of compliance probabilities for several activities, parents are trained in the use of treatment procedures, including reinforcing compliance, ignoring noncompliance, and avoiding requests from activities less likely to result in compliance.
broader: behavioral therapy
type: Concept