ethical hedonism
definition: The term hedonism, from the Greek root word hedone(pleasure), is the multifaceted philosophy that individuals should maximize pleasure and minimize pain. Two major views of this philosophy are psychological hedonism and ethical hedonism. [Source: Encyclopedia of Business Ethics and Society; Hedonism, Ethical]
broader: theories of ethics
type: Concept

theories of ethics
type: Concept
narrower: ethical hedonism

concepts
type: Collection
type: ConceptGroup
member: ethical hedonism