methods for studying relationships
type: Concept
narrower: ethical issues in relationship research

ethical issues in relationship research
definition: To advance the human sciences, researchers invariably need human subjects or participants. However, a balance must exist between the rewards in knowledge gained from the research and the potential costs to the research participants. [Source: Encyclopedia of Human Relationships; Ethical Issues in Relationship Research]
broader: methods for studying relationships
type: Concept

concepts
type: Collection
type: ConceptGroup
member: ethical issues in relationship research