ethics of community-based sanctions
definition: A variety of ethical concerns are related to community-based sanctions, particularly moral arguments vis-à-vis community-based sanctions as an alternative to imprisonment. This overview first considers what it means to take a human rights and human dignity approach to community-based sanctions. [Source: Encyclopedia of Community Corrections; Ethics of Community-Based Sanctions]
broader: history, development, and definitions
type: Concept

history, development, and definitions
type: Concept
narrower: ethics of community-based sanctions

concepts
type: Collection
type: ConceptGroup
member: ethics of community-based sanctions